Bug Issue: Execution failed for task ':deps:purchases:compileReleaseAidl


Pages: 1

Fulook

  • Junior Stencyler
June 30, 2019, 09:27:37 am
Why do I have "Deprecated Gradle features", "no history available" and aidl.exe pop up fail message box when testing Android game?

In Flash and html 5 work fine.

I have installed sdk 26, and other installed the newest in the Preferences-- Tools ---download.
Minimum sdk 23.
jdk 1.8

My phone:
 android 6, and already check the usb debug , awake.
Charge mode.

Stencyl version  4.0..1

Thankyou


Here is my log:
Code: [Select]
[haxelib.exe] addFolder(C:\StencylWork\stencylworks\android-builds\DropBlock2\google\intermediates\classes\release\org\haxe\extension, org/haxe/extension/)
2019-06-30 23:38:24,267 INFO  [Thread-14] stencyl.sw.util.StreamGobbler: [haxelib.exe] :deps:google:transformClassesAndResourcesWithSyncLibJarsForRelease (Thread[Task worker for ':',5,main]) completed. Took 0.041 secs.
2019-06-30 23:38:24,267 INFO  [Thread-14] stencyl.sw.util.StreamGobbler: [haxelib.exe] :deps:google:mergeReleaseJniLibFolders (Thread[Task worker for ':',5,main]) started.
2019-06-30 23:38:24,267 INFO  [Thread-14] stencyl.sw.util.StreamGobbler: [haxelib.exe] > Task :deps:google:mergeReleaseJniLibFolders
2019-06-30 23:38:24,267 INFO  [Thread-14] stencyl.sw.util.StreamGobbler: [haxelib.exe] Task ':deps:google:mergeReleaseJniLibFolders' is not up-to-date because:
2019-06-30 23:38:24,267 INFO  [Thread-14] stencyl.sw.util.StreamGobbler: [haxelib.exe]   No history is available.
2019-06-30 23:38:24,267 INFO  [Thread-14] stencyl.sw.util.StreamGobbler: [haxelib.exe] All input files are considered out-of-date for incremental task ':deps:google:mergeReleaseJniLibFolders'.
2019-06-30 23:38:24,267 INFO  [Thread-14] stencyl.sw.util.StreamGobbler: [haxelib.exe] Unable do incremental execution: full task run
2019-06-30 23:38:24,267 INFO  [Thread-14] stencyl.sw.util.StreamGobbler: [haxelib.exe] :deps:google:mergeReleaseJniLibFolders (Thread[Task worker for ':',5,main]) completed. Took 0.008 secs.
2019-06-30 23:38:24,267 INFO  [Thread-14] stencyl.sw.util.StreamGobbler: [haxelib.exe] :deps:google:transformNativeLibsWithMergeJniLibsForRelease (Thread[Task worker for ':',5,main]) started.
2019-06-30 23:38:24,267 INFO  [Thread-14] stencyl.sw.util.StreamGobbler: [haxelib.exe] > Task :deps:google:transformNativeLibsWithMergeJniLibsForRelease
2019-06-30 23:38:24,267 INFO  [Thread-14] stencyl.sw.util.StreamGobbler: [haxelib.exe] Task ':deps:google:transformNativeLibsWithMergeJniLibsForRelease' is not up-to-date because:
2019-06-30 23:38:24,267 INFO  [Thread-14] stencyl.sw.util.StreamGobbler: [haxelib.exe]   No history is available.
2019-06-30 23:38:24,267 INFO  [Thread-14] stencyl.sw.util.StreamGobbler: [haxelib.exe] All input files are considered out-of-date for incremental task ':deps:google:transformNativeLibsWithMergeJniLibsForRelease'.
2019-06-30 23:38:24,267 INFO  [Thread-14] stencyl.sw.util.StreamGobbler: [haxelib.exe] :deps:google:transformNativeLibsWithMergeJniLibsForRelease (Thread[Task worker for ':',5,main]) completed. Took 0.002 secs.
2019-06-30 23:38:24,267 INFO  [Thread-14] stencyl.sw.util.StreamGobbler: [haxelib.exe] :deps:google:transformNativeLibsWithStripDebugSymbolForRelease (Thread[Task worker for ':',5,main]) started.
2019-06-30 23:38:24,376 INFO  [Thread-14] stencyl.sw.util.StreamGobbler: [haxelib.exe] > Task :deps:google:transformNativeLibsWithStripDebugSymbolForRelease
2019-06-30 23:38:24,376 INFO  [Thread-14] stencyl.sw.util.StreamGobbler: [haxelib.exe] Task ':deps:google:transformNativeLibsWithStripDebugSymbolForRelease' is not up-to-date because:
2019-06-30 23:38:24,376 INFO  [Thread-14] stencyl.sw.util.StreamGobbler: [haxelib.exe]   No history is available.
2019-06-30 23:38:24,376 INFO  [Thread-14] stencyl.sw.util.StreamGobbler: [haxelib.exe] All input files are considered out-of-date for incremental task ':deps:google:transformNativeLibsWithStripDebugSymbolForRelease'.
2019-06-30 23:38:24,376 INFO  [Thread-14] stencyl.sw.util.StreamGobbler: [haxelib.exe] :deps:google:transformNativeLibsWithStripDebugSymbolForRelease (Thread[Task worker for ':',5,main]) completed. Took 0.05 secs.
2019-06-30 23:38:24,376 INFO  [Thread-14] stencyl.sw.util.StreamGobbler: [haxelib.exe] :deps:google:transformNativeLibsWithSyncJniLibsForRelease (Thread[Task worker for ':',5,main]) started.
2019-06-30 23:38:24,376 INFO  [Thread-14] stencyl.sw.util.StreamGobbler: [haxelib.exe] > Task :deps:google:transformNativeLibsWithSyncJniLibsForRelease
2019-06-30 23:38:24,376 INFO  [Thread-14] stencyl.sw.util.StreamGobbler: [haxelib.exe] Task ':deps:google:transformNativeLibsWithSyncJniLibsForRelease' is not up-to-date because:
2019-06-30 23:38:24,376 INFO  [Thread-14] stencyl.sw.util.StreamGobbler: [haxelib.exe]   No history is available.
2019-06-30 23:38:24,376 INFO  [Thread-14] stencyl.sw.util.StreamGobbler: [haxelib.exe] All input files are considered out-of-date for incremental task ':deps:google:transformNativeLibsWithSyncJniLibsForRelease'.
2019-06-30 23:38:24,376 INFO  [Thread-14] stencyl.sw.util.StreamGobbler: [haxelib.exe] :deps:google:transformNativeLibsWithSyncJniLibsForRelease (Thread[Task worker for ':',5,main]) completed. Took 0.002 secs.
2019-06-30 23:38:24,376 INFO  [Thread-14] stencyl.sw.util.StreamGobbler: [haxelib.exe] :deps:google:bundleRelease (Thread[Task worker for ':',5,main]) started.
2019-06-30 23:38:24,376 INFO  [Thread-14] stencyl.sw.util.StreamGobbler: [haxelib.exe] > Task :deps:google:bundleRelease
2019-06-30 23:38:24,376 INFO  [Thread-14] stencyl.sw.util.StreamGobbler: [haxelib.exe] Task ':deps:google:bundleRelease' is not up-to-date because:
2019-06-30 23:38:24,376 INFO  [Thread-14] stencyl.sw.util.StreamGobbler: [haxelib.exe]   No history is available.
2019-06-30 23:38:24,376 INFO  [Thread-14] stencyl.sw.util.StreamGobbler: [haxelib.exe] :deps:google:bundleRelease (Thread[Task worker for ':',5,main]) completed. Took 0.017 secs.
2019-06-30 23:38:24,376 INFO  [Thread-14] stencyl.sw.util.StreamGobbler: [haxelib.exe] :deps:purchases:preBuild (Thread[Task worker for ':',5,main]) started.
2019-06-30 23:38:24,376 INFO  [Thread-14] stencyl.sw.util.StreamGobbler: [haxelib.exe] > Task :deps:purchases:preBuild UP-TO-DATE
2019-06-30 23:38:24,392 INFO  [Thread-14] stencyl.sw.util.StreamGobbler: [haxelib.exe] Skipping task ':deps:purchases:preBuild' as it has no actions.
2019-06-30 23:38:24,392 INFO  [Thread-14] stencyl.sw.util.StreamGobbler: [haxelib.exe] :deps:purchases:preBuild (Thread[Task worker for ':',5,main]) completed. Took 0.0 secs.
2019-06-30 23:38:24,392 INFO  [Thread-14] stencyl.sw.util.StreamGobbler: [haxelib.exe] :deps:purchases:preReleaseBuild (Thread[Task worker for ':',5,main]) started.
2019-06-30 23:38:24,392 INFO  [Thread-14] stencyl.sw.util.StreamGobbler: [haxelib.exe] > Task :deps:purchases:preReleaseBuild UP-TO-DATE
2019-06-30 23:38:24,392 INFO  [Thread-14] stencyl.sw.util.StreamGobbler: [haxelib.exe] Skipping task ':deps:purchases:preReleaseBuild' as it has no actions.
2019-06-30 23:38:24,392 INFO  [Thread-14] stencyl.sw.util.StreamGobbler: [haxelib.exe] :deps:purchases:preReleaseBuild (Thread[Task worker for ':',5,main]) completed. Took 0.0 secs.
2019-06-30 23:38:24,392 INFO  [Thread-14] stencyl.sw.util.StreamGobbler: [haxelib.exe] :deps:purchases:checkReleaseManifest (Thread[Task worker for ':',5,main]) started.
2019-06-30 23:38:24,392 INFO  [Thread-14] stencyl.sw.util.StreamGobbler: [haxelib.exe] > Task :deps:purchases:checkReleaseManifest
2019-06-30 23:38:24,392 INFO  [Thread-14] stencyl.sw.util.StreamGobbler: [haxelib.exe] Task ':deps:purchases:checkReleaseManifest' is not up-to-date because:
2019-06-30 23:38:24,392 INFO  [Thread-14] stencyl.sw.util.StreamGobbler: [haxelib.exe]   Task has not declared any outputs despite executing actions.
2019-06-30 23:38:24,392 INFO  [Thread-14] stencyl.sw.util.StreamGobbler: [haxelib.exe] :deps:purchases:checkReleaseManifest (Thread[Task worker for ':',5,main]) completed. Took 0.0 secs.
2019-06-30 23:38:24,392 INFO  [Thread-14] stencyl.sw.util.StreamGobbler: [haxelib.exe] :deps:purchases:prepareReleaseDependencies (Thread[Task worker for ':',5,main]) started.
2019-06-30 23:38:24,392 INFO  [Thread-14] stencyl.sw.util.StreamGobbler: [haxelib.exe] > Task :deps:purchases:prepareReleaseDependencies
2019-06-30 23:38:24,392 INFO  [Thread-14] stencyl.sw.util.StreamGobbler: [haxelib.exe] Task ':deps:purchases:prepareReleaseDependencies' is not up-to-date because:
2019-06-30 23:38:24,392 INFO  [Thread-14] stencyl.sw.util.StreamGobbler: [haxelib.exe]   Task has not declared any outputs despite executing actions.
2019-06-30 23:38:24,392 INFO  [Thread-14] stencyl.sw.util.StreamGobbler: [haxelib.exe] :deps:purchases:prepareReleaseDependencies (Thread[Task worker for ':',5,main]) completed. Took 0.0 secs.
2019-06-30 23:38:24,392 INFO  [Thread-14] stencyl.sw.util.StreamGobbler: [haxelib.exe] :deps:purchases:compileReleaseAidl (Thread[Task worker for ':',5,main]) started.
2019-06-30 23:38:24,392 INFO  [Thread-14] stencyl.sw.util.StreamGobbler: [haxelib.exe] Starting process 'command 'C:\StencylWork\stencylworks\android-sdk\android-sdk-windows\build-tools\29.0.0\aidl.exe''. Working directory: C:\StencylWork\stencylworks\games-generated\DropBlock2\Export\android\bin\deps\purchases Command: C:\StencylWork\stencylworks\android-sdk\android-sdk-windows\build-tools\29.0.0\aidl.exe -pC:\StencylWork\stencylworks\android-sdk\android-sdk-windows\platforms\android-26\framework.aidl -oC:\StencylWork\stencylworks\android-builds\DropBlock2\purchases\generated\source\aidl\release -IC:\StencylWork\stencylworks\games-generated\DropBlock2\Export\android\bin\deps\purchases\src -IC:\StencylWork\stencylworks\games-generated\DropBlock2\Export\android\bin\deps\purchases\src\release\aidl -IC:\StencylWork\stencylworks\android-builds\DropBlock2\extension-api\intermediates\bundles\default\aidl -dC:\Users\Lwindow\AppData\Local\Temp\aidl1381061273038245221.d C:\StencylWork\stencylworks\games-generated\DropBlock2\Export\android\bin\deps\purchases\src\com\android\vending\billing\IInAppBillingService.aidl
2019-06-30 23:38:24,392 INFO  [Thread-14] stencyl.sw.util.StreamGobbler: [haxelib.exe] Successfully started process 'command 'C:\StencylWork\stencylworks\android-sdk\android-sdk-windows\build-tools\29.0.0\aidl.exe''
2019-06-30 23:38:26,373 INFO  [Thread-14] stencyl.sw.util.StreamGobbler: [haxelib.exe] > Task :deps:purchases:compileReleaseAidl
2019-06-30 23:38:26,373 INFO  [Thread-14] stencyl.sw.util.StreamGobbler: [haxelib.exe] Task ':deps:purchases:compileReleaseAidl' is not up-to-date because:
2019-06-30 23:38:26,373 INFO  [Thread-14] stencyl.sw.util.StreamGobbler: [haxelib.exe]   No history is available.
2019-06-30 23:38:26,373 INFO  [Thread-14] stencyl.sw.util.StreamGobbler: [haxelib.exe] All input files are considered out-of-date for incremental task ':deps:purchases:compileReleaseAidl'.
2019-06-30 23:38:34,376 INFO  [Thread-14] stencyl.sw.util.StreamGobbler: [haxelib.exe] > Task :deps:purchases:compileReleaseAidl FAILED
2019-06-30 23:38:34,376 INFO  [Thread-14] stencyl.sw.util.StreamGobbler: [haxelib.exe] :deps:purchases:compileReleaseAidl (Thread[Task worker for ':',5,main]) completed. Took 9.944 secs.
2019-06-30 23:38:34,376 ERROR [Thread-14] stencyl.sw.util.dg.MessageDialog: Encountered errors while building your game.: Check your logs and post them to the forums.  - Please describe what you have been doing. Be as specific as possible.
2019-06-30 23:38:34,953 DEBUG [pool-1-thread-1] stencyl.sw.util.Util: Process 'haxelib.exe' exited with code: 1
2019-06-30 23:38:36,419 ERROR [Thread-14] stencyl.sw.util.StreamGobbler: [haxelib.exe] FAILURE: Build failed with an exception.
2019-06-30 23:38:36,419 INFO  [Thread-14] stencyl.sw.util.StreamGobbler: [haxelib.exe] * What went wrong:
2019-06-30 23:38:36,419 INFO  [Thread-14] stencyl.sw.util.StreamGobbler: [haxelib.exe] Execution failed for task ':deps:purchases:compileReleaseAidl'.
2019-06-30 23:38:36,419 INFO  [Thread-14] stencyl.sw.util.StreamGobbler: [haxelib.exe] > java.lang.RuntimeException: com.android.ide.common.process.ProcessException: Error while executing process C:\StencylWork\stencylworks\android-sdk\android-sdk-windows\build-tools\29.0.0\aidl.exe with arguments {-pC:\StencylWork\stencylworks\android-sdk\android-sdk-windows\platforms\android-26\framework.aidl -oC:\StencylWork\stencylworks\android-builds\DropBlock2\purchases\generated\source\aidl\release -IC:\StencylWork\stencylworks\games-generated\DropBlock2\Export\android\bin\deps\purchases\src -IC:\StencylWork\stencylworks\games-generated\DropBlock2\Export\android\bin\deps\purchases\src\release\aidl -IC:\StencylWork\stencylworks\android-builds\DropBlock2\extension-api\intermediates\bundles\default\aidl -dC:\Users\Lwindow\AppData\Local\Temp\aidl1381061273038245221.d C:\StencylWork\stencylworks\games-generated\DropBlock2\Export\android\bin\deps\purchases\src\com\android\vending\billing\IInAppBillingService.aidl}
2019-06-30 23:38:36,419 INFO  [Thread-14] stencyl.sw.util.StreamGobbler: [haxelib.exe] * Try:
2019-06-30 23:38:36,419 INFO  [Thread-14] stencyl.sw.util.StreamGobbler: [haxelib.exe] Run with --stacktrace option to get the stack trace. Run with --debug option to get more log output. Run with --scan to get full insights.
2019-06-30 23:38:36,419 INFO  [Thread-14] stencyl.sw.util.StreamGobbler: [haxelib.exe] * Get more help at [url=https://help.gradle.org]https://help.gradle.org[/url]
2019-06-30 23:38:36,419 INFO  [Thread-14] stencyl.sw.util.StreamGobbler: [haxelib.exe] Deprecated Gradle features were used in this build, making it incompatible with Gradle 5.0.
2019-06-30 23:38:36,419 INFO  [Thread-14] stencyl.sw.util.StreamGobbler: [haxelib.exe] See [url=https://docs.gradle.org/4.7/userguide/command_line_interface.html#sec:command_line_warnings]https://docs.gradle.org/4.7/userguide/command_line_interface.html#sec:command_line_warnings[/url]
2019-06-30 23:38:36,419 ERROR [Thread-14] stencyl.sw.util.dg.MessageDialog: Encountered errors while building your game.: Check your logs and post them to the forums.  - Please describe what you have been doing. Be as specific as possible.
2019-06-30 23:38:40,335 DEBUG [pool-1-thread-3] stencyl.sw.util.FileHelper: Matching (non-hidden) files within C:\StencylWork\stencylworks\logs: [C:\StencylWork\stencylworks\logs\2019-06-30_23-17-29.log, C:\StencylWork\stencylworks\logs\2019-06-30_23-18-53.log, C:\StencylWork\stencylworks\logs\2019-06-30_23-32-10.log]
2019-06-30 23:38:44,781 DEBUG [AWT-EventQueue-0] stencyl.sw.util.dg.MessageDialog: Wrote out Logs to the following location: - C:\Users\Lwindow\Desktop\log-2019-06-30.zip
2019-06-30 23:38:45,623 DEBUG [AWT-EventQueue-0] stencyl.sw.util.Util: Running command: [explorer, /select,, C:\Users\Lwindow\Desktop\log-2019-06-30.zip]
2019-06-30 23:38:45,639 DEBUG [AWT-EventQueue-0] stencyl.sw.util.FileHelper: Deleting: C:\StencylWork\stencylworks\tempLogs
2019-06-30 23:38:48,899 ERROR [Thread-14] stencyl.sw.util.StreamGobbler: [haxelib.exe] BUILD FAILED in 22s
2019-06-30 23:38:48,899 INFO  [Thread-14] stencyl.sw.util.StreamGobbler: [haxelib.exe] 86 actionable tasks: 86 executed
2019-06-30 23:38:48,899 ERROR [pool-1-thread-1] stencyl.sw.app.tasks.buildgame.GameBuilder: Failed: Running Android. (Return code: 1)



« Last Edit: July 01, 2019, 01:00:56 am by Fulook »


Justin

  • Master Stencyler
  • *
June 30, 2019, 12:42:00 pm
This is a problem with the latest versions of the android tools you downloaded. We've limited the downloads in the customers-only private releases of Stencyl, and the fix will be available to everybody next time we make a public release.

To fix this manually, you'll need to delete this folder:
Code: [Select]
C:\StencylWork\stencylworks\android-sdk\android-sdk-windows\build-tools\29.0.0

Then, open the android tools download dialog again, and uncheck everything but the "build tools" download. Download one of the 28.0.x versions instead of 29. Then you should be good to go.
« Last Edit: June 30, 2019, 12:42:37 pm by Justin »


Fulook

  • Junior Stencyler
July 01, 2019, 01:03:06 am
It fix, thankyou :).


Pages: 1

Details

  • Reported
    June 30, 2019, 09:27:37 am
  • Updated
    July 01, 2019, 01:03:06 am

  • View Status
    Public
  • Type
    Bug
  • Status
    New
  • Priority
    Normal
  • Version
    (none)
  • Fixed in
    (none)
  • Assigned to
    (none)
  • Category
    Compiling/Testing Games

Tags